Target
C-C chemokine receptor type 4
Ligand
BDBM50545768
Substrate
Meas. Tech.
ChEMBL_1996547 (CHEMBL4630442)
IC50
6.0±n/a nM
Citation
 Robles, OJackson, JJMarshall, LTalay, OChian, DCutler, GDiokno, RHu, DXJacobson, SKarbarz, EKassner, PDKetcham, JMMcKinnell, JMeleza, CReilly, MKRiegler, EShunatona, HPWadsworth, AYounai, ABrockstedt, DGWustrow, DJZibinsky, M Novel Piperidinyl-Azetidines as Potent and Selective CCR4 Antagonists Elicit Antitumor Response as a Single Agent and in Combination with Checkpoint Inhibitors. J Med Chem 63:8584-8607 (2020)  
Target
Name:
C-C chemokine receptor type 4
Synonyms:
C-C CKR-4 C-C chemokine receptor type 4 (CCR4) CCR-4 CCR4_HUMAN CMKBR4 | K5-5
Type:
Enzyme
Mol. Mass.:
41406.41
Organism:
Homo sapiens (Human)
Description:
P51679
Residue:
360
  
Inhibitor
Name:
BDBM50545768
Synonyms:
CHEMBL4641127
Type:
Small organic molecule
Emp. Form.:
C26H33Cl2N7O
Mol. Mass.:
530.493
SMILES:
C[C@H](c1ccc(Cl)cc1Cl)n1nc(C)c2ncc(nc12)N1CC(C1)[C@H]1CCCN(CCNC(C)=O)C1
: