Target
Glucagon receptor
Ligand
BDBM50104069
Substrate
Meas. Tech.
ChEMBL_72866 (CHEMBL683962)
IC50
4900±n/a nM
Citation
 Ling, AHong, YGonzalez, JGregor, VPolinsky, AKuki, AShi, STeston, KMurphy, DPorter, JKiel, DLakis, JAnderes, KMay, JKnudsen, LBLau, J Identification of alkylidene hydrazides as glucagon receptor antagonists. J Med Chem 44:3141-9 (2001)  
Target
Name:
Glucagon receptor
Synonyms:
GCGR GLR_HUMAN Glucagon receptor (GlucR)
Type:
Enzyme
Mol. Mass.:
54026.92
Organism:
Homo sapiens (Human)
Description:
P47871
Residue:
477
  
Inhibitor
Name:
BDBM50104069
Synonyms:
4-Hydroxy-benzoic acid (4-methoxy-naphthalen-1-ylmethylene)-hydrazide | CHEMBL106134
Type:
Small organic molecule
Emp. Form.:
C19H16N2O3
Mol. Mass.:
320.3419
SMILES:
COc1ccc(\C=N\NC(=O)c2ccc(O)cc2)c2ccccc12
: