Target
Glucagon receptor
Ligand
BDBM50104085
Substrate
Meas. Tech.
ChEMBL_72866 (CHEMBL683962)
IC50
>100000±n/a nM
Citation
 Ling, AHong, YGonzalez, JGregor, VPolinsky, AKuki, AShi, STeston, KMurphy, DPorter, JKiel, DLakis, JAnderes, KMay, JKnudsen, LBLau, J Identification of alkylidene hydrazides as glucagon receptor antagonists. J Med Chem 44:3141-9 (2001)  
Target
Name:
Glucagon receptor
Synonyms:
GCGR GLR_HUMAN Glucagon receptor (GlucR)
Type:
Enzyme
Mol. Mass.:
54026.92
Organism:
Homo sapiens (Human)
Description:
P47871
Residue:
477
  
Inhibitor
Name:
BDBM50104085
Synonyms:
4-Hydroxy-3-methoxy-benzoic acid (4-styryl-benzylidene)-hydrazide | CHEMBL431650
Type:
Small organic molecule
Emp. Form.:
C23H20N2O3
Mol. Mass.:
372.4165
SMILES:
COc1cc(ccc1O)C(=O)N\N=C\c1ccc(\C=C\c2ccccc2)cc1
: