Target
Glucagon receptor
Ligand
BDBM50104084
Substrate
Meas. Tech.
ChEMBL_72866 (CHEMBL683962)
IC50
>100000±n/a nM
Citation
 Ling, AHong, YGonzalez, JGregor, VPolinsky, AKuki, AShi, STeston, KMurphy, DPorter, JKiel, DLakis, JAnderes, KMay, JKnudsen, LBLau, J Identification of alkylidene hydrazides as glucagon receptor antagonists. J Med Chem 44:3141-9 (2001)  
Target
Name:
Glucagon receptor
Synonyms:
GCGR GLR_HUMAN Glucagon receptor (GlucR)
Type:
Enzyme
Mol. Mass.:
54026.92
Organism:
Homo sapiens (Human)
Description:
P47871
Residue:
477
  
Inhibitor
Name:
BDBM50104084
Synonyms:
1H-Indole-5-carboxylic acid (4-hydroxy-naphthalen-1-ylmethylene)-hydrazide | CHEMBL107480
Type:
Small organic molecule
Emp. Form.:
C20H15N3O2
Mol. Mass.:
329.352
SMILES:
Oc1ccc(\C=N\NC(=O)c2ccc3[nH]ccc3c2)c2ccccc12
: