Target
Glucagon receptor
Ligand
BDBM50104094
Substrate
Meas. Tech.
ChEMBL_72866 (CHEMBL683962)
IC50
4800±n/a nM
Citation
 Ling, AHong, YGonzalez, JGregor, VPolinsky, AKuki, AShi, STeston, KMurphy, DPorter, JKiel, DLakis, JAnderes, KMay, JKnudsen, LBLau, J Identification of alkylidene hydrazides as glucagon receptor antagonists. J Med Chem 44:3141-9 (2001)  
Target
Name:
Glucagon receptor
Synonyms:
GCGR GLR_HUMAN Glucagon receptor (GlucR)
Type:
Enzyme
Mol. Mass.:
54026.92
Organism:
Homo sapiens (Human)
Description:
P47871
Residue:
477
  
Inhibitor
Name:
BDBM50104094
Synonyms:
4-Hydroxy-3-methoxy-benzoic acid naphthalen-1-ylmethylene-hydrazide | CHEMBL104761
Type:
Small organic molecule
Emp. Form.:
C19H16N2O3
Mol. Mass.:
320.3419
SMILES:
COc1cc(ccc1O)C(=O)N\N=C\c1cccc2ccccc12
: