Target
Glucagon receptor
Ligand
BDBM50104096
Substrate
Meas. Tech.
ChEMBL_73015 (CHEMBL681694)
IC50
27±n/a nM
Citation
 Ling, AHong, YGonzalez, JGregor, VPolinsky, AKuki, AShi, STeston, KMurphy, DPorter, JKiel, DLakis, JAnderes, KMay, JKnudsen, LBLau, J Identification of alkylidene hydrazides as glucagon receptor antagonists. J Med Chem 44:3141-9 (2001)  
Target
Name:
Glucagon receptor
Synonyms:
GL-R Gcgr
Type:
PROTEIN
Mol. Mass.:
55053.40
Organism:
Rattus norvegicus
Description:
ChEMBL_1450588
Residue:
485
  
Inhibitor
Name:
BDBM50104096
Synonyms:
3-Chloro-4-hydroxy-benzoic acid (4-hydroxy-naphthalen-1-ylmethylene)-hydrazide CHEMBL107070
Type:
Small organic molecule
Emp. Form.:
C18H13ClN2O3
Mol. Mass.:
340.76
SMILES:
Oc1ccc(cc1Cl)C(=O)N\N=C\c1ccc(O)c2ccccc12
: