Target
Tyrosine-protein kinase JAK1
Ligand
BDBM50545945
Substrate
Meas. Tech.
ChEMBL_2013351 (CHEMBL4666929)
Ki
0.210000±n/a nM
Citation
 Zak, MHanan, EJLupardus, PBrown, DGRobinson, CSiu, MLyssikatos, JPRomero, FAZhao, GKellar, TMendonca, RRay, NCGoodacre, SCCrackett, PHMcLean, NHurley, CAYuen, PWCheng, YXLiu, XLiimatta, MKohli, PBNonomiya, JSalmon, GBuckley, GLloyd, JGibbons, PGhilardi, NKenny, JRJohnson, A Discovery of a class of highly potent Janus Kinase 1/2 (JAK1/2) inhibitors demonstrating effective cell-based blockade of IL-13 signaling. Bioorg Med Chem Lett 29:1522-1531 (2019)  
Target
Name:
Tyrosine-protein kinase JAK1
Synonyms:
JAK-1 JAK1A JAK1_HUMAN Janus kinase 1 (JAK1) | Janus kinase 1 JAK1
Type:
Protein
Mol. Mass.:
133293.73
Organism:
Homo sapiens (Human)
Description:
P23458
Residue:
1154
  
Inhibitor
Name:
BDBM50545945
Synonyms:
CHEMBL4777342
Type:
Small organic molecule
Emp. Form.:
C18H13ClF2N6O2
Mol. Mass.:
418.785
SMILES:
Cn1cc(NC(=O)c2cnn3cccnc23)c(n1)-c1cc(Cl)ccc1OC(F)F
: