Target
Calpain-1 catalytic subunit
Ligand
BDBM50101321
Substrate
Meas. Tech.
ChEBML_43500
IC50
6±n/a nM
Citation
 Josef, KAKauer, FWBihovsky, R Potent peptide alpha-ketohydroxamate inhibitors of recombinant human calpain I. Bioorg Med Chem Lett 11:2615-7 (2001)  
Target
Name:
Calpain-1 catalytic subunit
Synonyms:
CAN1_HUMAN CAPN1 Calpain-1 (u-Calpain) Calpain1
Type:
Protein
Mol. Mass.:
81880.51
Organism:
Homo sapiens (Human)
Description:
Residue:
714
  
Inhibitor
Name:
BDBM50101321
Synonyms:
CHEMBL299750 | [(S)-1-((S)-1-Benzyl-2-benzyloxycarbamoyl-2-oxo-ethylcarbamoyl)-3-methyl-butyl]-carbamic acid benzyl ester
Type:
Small organic molecule
Emp. Form.:
C31H35N3O6
Mol. Mass.:
545.6261
SMILES:
CC(C)C[C@H](NC(=O)OCc1ccccc1)C(=O)N[C@@H](Cc1ccccc1)C(=O)C(=O)NOCc1ccccc1
: