Target
Aldo-keto reductase family 1 member C4
Ligand
BDBM50240376
Substrate
Meas. Tech.
ChEMBL_2014957 (CHEMBL4668535)
IC50
4040±n/a nM
Citation
 Liu, YHe, SChen, YLiu, YFeng, FLiu, WGuo, QZhao, LSun, H Overview of AKR1C3: Inhibitor Achievements and Disease Insights. J Med Chem 63:11305-11329 (2020)  
Target
Name:
Aldo-keto reductase family 1 member C4
Synonyms:
3-alpha-HSD1 3-alpha-hydroxysteroid dehydrogenase type I AKR1C4 Aldo-keto reductase family 1 member C4 (AK1C4) CHDR DD-4 Dihydrodiol dehydrogenase 4 | HAKRA
Type:
Enzyme
Mol. Mass.:
37068.40
Organism:
Homo sapiens (Human)
Description:
P17516
Residue:
323
  
Inhibitor
Name:
BDBM50240376
Synonyms:
3,4,5-Trihydroxy-benzoic acid octyl ester US11565996, Compound Octyl Gallate octyl gallate
Type:
Small organic molecule
Emp. Form.:
C15H22O5
Mol. Mass.:
282.3322
SMILES:
CCCCCCCCOC(=O)c1cc(O)c(O)c(O)c1
: