Target
Nonstructural protein 5A
Ligand
BDBM50547646
Substrate
Meas. Tech.
ChEMBL_2018863 (CHEMBL4672441)
IC50
0.010±n/a nM
Citation
 Ivashchenko, AAIvanenkov, YAAladinskiy, VAKarapetian, RNKoryakova, AGRyakhovskiy, AAMitkin, ODKravchenko, DVSavchuk, NPZagribelnyy, BAIvashchenko, AV Synthesis, biological evaluation and in silico modeling of novel pan-genotypic NS5A inhibitors. Bioorg Med Chem 28:0 (2020)  
Target
Name:
Nonstructural protein 5A
Synonyms:
NS5A | Nonstructural protein 5A
Type:
PROTEIN
Mol. Mass.:
48587.20
Organism:
Hepatitis C virus
Description:
ChEMBL_108438
Residue:
447
  
Inhibitor
Name:
BDBM50547646
Synonyms:
CHEMBL4780371
Type:
Small organic molecule
Emp. Form.:
C51H58Cl2N8O6
Mol. Mass.:
949.962
SMILES:
Cl.Cl.COC(=O)N[C@@H](C(C)C)C(=O)N1CCC[C@H]1c1ncc([nH]1)-c1ccc(C#CC#Cc2cnc([nH]2)[C@@H]2CCCN2C(=O)[C@H](NC(=O)OC)c2ccccc2)c(c1)-c1ccc(cc1)C(C)(C)C
: