Target
Nonstructural protein 5A
Ligand
BDBM50547638
Substrate
Meas. Tech.
ChEMBL_2018865 (CHEMBL4672443)
IC50
0.001±n/a nM
Citation
 Ivashchenko, AAIvanenkov, YAAladinskiy, VAKarapetian, RNKoryakova, AGRyakhovskiy, AAMitkin, ODKravchenko, DVSavchuk, NPZagribelnyy, BAIvashchenko, AV Synthesis, biological evaluation and in silico modeling of novel pan-genotypic NS5A inhibitors. Bioorg Med Chem 28:0 (2020)  
Target
Name:
Nonstructural protein 5A
Synonyms:
NS5A | Nonstructural protein 5A
Type:
PROTEIN
Mol. Mass.:
48587.20
Organism:
Hepatitis C virus
Description:
ChEMBL_108438
Residue:
447
  
Inhibitor
Name:
BDBM50547638
Synonyms:
CHEMBL4782728
Type:
Small organic molecule
Emp. Form.:
C47H49Cl2FN8O6
Mol. Mass.:
911.846
SMILES:
Cl.Cl.COC(=O)N[C@@H](C(C)C)C(=O)N1CCC[C@H]1c1ncc([nH]1)-c1cc(F)c(C#CC#Cc2cnc([nH]2)[C@@H]2CCCN2C(=O)[C@H](NC(=O)OC)c2ccccc2)c(c1)-c1ccccc1
: