Target
Myosin-2
Ligand
BDBM50546882
Substrate
Meas. Tech.
ChEMBL_2016970 (CHEMBL4670548)
IC50
400±n/a nM
Citation
 Brawley, JEtter, EHeredia, DIntasiri, ANennecker, KSmith, JWelcome, BMBrizendine, RKGould, TWBell, TWCremo, C Synthesis and Evaluation of 4-Hydroxycoumarin Imines as Inhibitors of Class II Myosins. J Med Chem 63:11131-11148 (2020)  
Target
Name:
Myosin-2
Synonyms:
MYH2 MyHC-2a Myosin heavy chain 2a Myosin-2
Type:
PROTEIN
Mol. Mass.:
223121.99
Organism:
Sus scrofa
Description:
ChEMBL_120109
Residue:
1939
  
Inhibitor
Name:
BDBM50546882
Synonyms:
CHEBI:75388 | CHEMBL1231358
Type:
Small organic molecule
Emp. Form.:
C18H16N2O2
Mol. Mass.:
292.3318
SMILES:
Cc1ccc2N=C3N(CC[C@@]3(O)C(=O)c2c1)c1ccccc1
: