Target
Myosin-2
Ligand
BDBM50546893
Substrate
Meas. Tech.
ChEMBL_2016972 (CHEMBL4670550)
IC50
7900±n/a nM
Citation
 Brawley, JEtter, EHeredia, DIntasiri, ANennecker, KSmith, JWelcome, BMBrizendine, RKGould, TWBell, TWCremo, C Synthesis and Evaluation of 4-Hydroxycoumarin Imines as Inhibitors of Class II Myosins. J Med Chem 63:11131-11148 (2020)  
Target
Name:
Myosin-2
Synonyms:
MYH2 MyHC-2a Myosin heavy chain 2a Myosin-2
Type:
PROTEIN
Mol. Mass.:
223289.89
Organism:
Bos taurus
Description:
ChEMBL_120107
Residue:
1940
  
Inhibitor
Name:
BDBM50546893
Synonyms:
CHEMBL4786536
Type:
Small organic molecule
Emp. Form.:
C19H17NO3
Mol. Mass.:
307.3432
SMILES:
C\C(=N/Cc1ccc(C)cc1)c1c(O)c2ccccc2oc1=O
: