Target
L-lactate dehydrogenase A chain
Ligand
BDBM50546988
Substrate
Meas. Tech.
ChEMBL_2017133 (CHEMBL4670711)
Kd
0.123500±n/a nM
Citation
Target
Name:
L-lactate dehydrogenase A chain
Synonyms:
Cell proliferation-inducing gene 19 protein L-lactate dehydrogenase A Chain LDH-A LDHA Lactate dehydrogenase A (LDHA) | Renal carcinoma antigen NY-REN-59
Type:
Protein
Mol. Mass.:
36694.85
Organism:
Homo sapiens (Human)
Description:
P00338::PDB Code: 4ajp
Residue:
332
  
Inhibitor
Name:
BDBM50546988
Synonyms:
CHEMBL4787852 | US11247971, Cmpd ID 411
Type:
Small organic molecule
Emp. Form.:
C32H30F2N4O4S2
Mol. Mass.:
636.732
SMILES:
NS(=O)(=O)c1ccc(Cc2c(CC3CC3)n(nc2-c2ccc(F)c(c2)C#CCC2CCCC2)-c2nc(cs2)C(O)=O)cc1F
: