Target
ATPase family AAA domain-containing protein 2B
Ligand
BDBM50547693
Substrate
Meas. Tech.
ChEMBL_2018963 (CHEMBL4672541)
Kd
34400±n/a nM
Citation
 Lloyd, JTMcLaughlin, KLubula, MYGay, JCDest, AGao, CPhillips, MTonelli, MCornilescu, GMarunde, MREvans, CMBoyson, SPCarlson, SKeogh, MCMarkley, JLFrietze, SGlass, KC Structural Insights into the Recognition of Mono- and Diacetylated Histones by the ATAD2B Bromodomain. J Med Chem 63:12799-12813 (2020)  
Target
Name:
ATPase family AAA domain-containing protein 2B
Synonyms:
ATAD2B ATPase family AAA domain-containing protein 2B | KIAA1240
Type:
PROTEIN
Mol. Mass.:
164918.65
Organism:
Homo sapiens (Human)
Description:
ChEMBL_105350
Residue:
1458
  
Inhibitor
Name:
BDBM50547693
Synonyms:
CHEMBL4794843
Type:
Small organic molecule
Emp. Form.:
C107H191N43O30
Mol. Mass.:
2559.9315
SMILES:
CC(C)C[C@H](NC(=O)CNC(=O)[C@H](CCCCN)NC(=O)CNC(=O)CNC(=O)[C@H](CCCCNC(C)=O)NC(=O)CNC(=O)[C@H](CCCNC(N)=N)NC(=O)CNC(=O)[C@@H](N)CO)C(=O)NCC(=O)N[C@@H](CCCCN)C(=O)NCC(=O)NCC(=O)N[C@@H](C)C(=O)N[C@@H](CCCCNC(C)=O)C(=O)N[C@@H](CCCNC(N)=N)C(=O)N[C@@H](Cc1cnc[nH]1)C(=O)N[C@@H](CCCNC(N)=N)C(=O)N[C@@H](CCCCN)C(=O)N[C@@H](C(C)C)C(=O)N[C@@H](CC(C)C)C(=O)N[C@@H](CCCNC(N)=N)C(=O)N[C@@H](CC(O)=O)C(O)=O
: