Target
Carbonic anhydrase 2
Ligand
BDBM50331834
Substrate
Meas. Tech.
ChEMBL_2018972 (CHEMBL4672550)
Ki
0.520000±n/a nM
Citation
 Andring, JTFouch, MAkocak, SAngeli, ASupuran, CTIlies, MAMcKenna, R Structural Basis of Nanomolar Inhibition of Tumor-Associated Carbonic Anhydrase IX: X-Ray Crystallographic and Inhibition Study of Lipophilic Inhibitors with Acetazolamide Backbone. J Med Chem 63:13064-13075 (2020)  
Target
Name:
Carbonic anhydrase 2
Synonyms:
CA-II CAC Carbonate dehydratase II Carbonic anhydrase 2 (CA-II) Carbonic anhydrase C Carbonic anhydrase II (CA-II) Carbonic anhydrase II (hCA II) | Carbonic anhydrase isoenzyme II (hCA II)
Type:
Enzyme
Mol. Mass.:
29250.71
Organism:
Homo sapiens (Human)
Description:
P00918
Residue:
260
  
Inhibitor
Name:
BDBM50331834
Synonyms:
5-butyramido-2-sulfamoyl-1,3,4-thiadiazole | CHEMBL1288787
Type:
Small organic molecule
Emp. Form.:
C6H10N4O3S2
Mol. Mass.:
250.299
SMILES:
CCCC(=O)Nc1nnc(s1)S(N)(=O)=O
: