Target
Estrogen receptor beta
Ligand
BDBM50106635
Substrate
Meas. Tech.
ChEMBL_67186 (CHEMBL677954)
EC50
6±n/a nM
Citation
 Meyers, MJSun, JCarlson, KEMarriner, GAKatzenellenbogen, BSKatzenellenbogen, JA Estrogen receptor-beta potency-selective ligands: structure-activity relationship studies of diarylpropionitriles and their acetylene and polar analogues. J Med Chem 44:4230-51 (2001)  
Target
Name:
Estrogen receptor beta
Synonyms:
ER-beta ESR2_HUMAN Estradiol receptor beta (ERβ) Estrogen receptor (ER beta) Estrogen receptor beta (ER beta) NR3A2 estrogen beta
Type:
Protein
Mol. Mass.:
59238.43
Organism:
Homo sapiens (Human)
Description:
Q92731
Residue:
530
  
Inhibitor
Name:
BDBM50106635
Synonyms:
(+/-)-2,3-bis(4-hydroxyphenyl)propanenitrile 2,3-bis(4-hydroxyphenyl)propanenitrile DIARYLPROPIONITRILE
Type:
Small organic molecule
Emp. Form.:
C15H13NO2
Mol. Mass.:
239.2692
SMILES:
Oc1ccc(CC(C#N)c2ccc(O)cc2)cc1
: