Target
Potassium voltage-gated channel subfamily H member 2
Ligand
BDBM50148648
Substrate
Meas. Tech.
ChEMBL_2021700 (CHEMBL4675513)
IC50
>30000±n/a nM
Citation
 Huang, WHulverson, MAChoi, RArnold, SLMZhang, ZMcCloskey, MCWhitman, GRHackman, RCRivas, KLBarrett, LKOjo, KKVan Voorhis, WCFan, E Development of 5-Aminopyrazole-4-carboxamide-based Bumped-Kinase Inhibitors for Cryptosporidiosis Therapy. J Med Chem 62:3135-3146 (2019)  
Target
Name:
Potassium voltage-gated channel subfamily H member 2
Synonyms:
1,3-beta-glucan synthase component GLS2 ERG Eag-related protein 1 Ether-a-go-go-related gene (HERG) Ether-a-go-go-related gene potassium channel 1 Ether-a-go-go-related gene potassium channel 1 (hERG1) Ether-a-go-go-related protein 1 H-ERG KCNH2 Potassium voltage-gated channel subfamily H member 2 (hERG) Voltage-gated potassium channel subunit Kv11.1 hERG Potassium Channel 1 | putative potassium channel subunit
Type:
Multi-pass membrane protein
Mol. Mass.:
126672.65
Organism:
Homo sapiens (Human)
Description:
Q12809
Residue:
1159
  
Inhibitor
Name:
BDBM50148648
Synonyms:
CHEMBL3770743 US9956214, Compound 1596
Type:
Small organic molecule
Emp. Form.:
C20H25N5O3
Mol. Mass.:
383.4442
SMILES:
CCOc1ccc2cc(cnc2c1)-c1nn(CC(C)(C)CO)c(N)c1C(N)=O
: