Target
Proto-oncogene tyrosine-protein kinase Src
Ligand
BDBM50148648
Substrate
Meas. Tech.
ChEMBL_2021704 (CHEMBL4675517)
IC50
>10000±n/a nM
Citation
 Huang, WHulverson, MAChoi, RArnold, SLMZhang, ZMcCloskey, MCWhitman, GRHackman, RCRivas, KLBarrett, LKOjo, KKVan Voorhis, WCFan, E Development of 5-Aminopyrazole-4-carboxamide-based Bumped-Kinase Inhibitors for Cryptosporidiosis Therapy. J Med Chem 62:3135-3146 (2019)  
Target
Name:
Proto-oncogene tyrosine-protein kinase Src
Synonyms:
Calmodulin/Proto-oncogene tyrosine-protein kinase Src Proto-oncogene c-Src SRC SRC_HUMAN V-src sarcoma (Schmidt-Ruppin A-2) viral oncogene homolog (avian) p60-Src | pp60c-src
Type:
Protein
Mol. Mass.:
59838.60
Organism:
Homo sapiens (Human)
Description:
P12931
Residue:
536
  
Inhibitor
Name:
BDBM50148648
Synonyms:
CHEMBL3770743 US9956214, Compound 1596
Type:
Small organic molecule
Emp. Form.:
C20H25N5O3
Mol. Mass.:
383.4442
SMILES:
CCOc1ccc2cc(cnc2c1)-c1nn(CC(C)(C)CO)c(N)c1C(N)=O
: