Target
Non-receptor tyrosine-protein kinase TYK2
Ligand
BDBM50548379
Substrate
Meas. Tech.
ChEMBL_2021996 (CHEMBL4675809)
IC50
10.0±n/a nM
Citation
 Gerstenberger, BSAmbler, CArnold, EPBanker, MEBrown, MFClark, JDDermenci, ADowty, MEFensome, AFish, SHayward, MMHegen, MHollingshead, BDKnafels, JDLin, DWLin, THOwen, DRSaiah, ESharma, RVajdos, FFXing, LYang, XYang, XWright, SW Discovery of Tyrosine Kinase 2 (TYK2) Inhibitor (PF-06826647) for the Treatment of Autoimmune Diseases. J Med Chem 63:13561-13577 (2020)  
Target
Name:
Non-receptor tyrosine-protein kinase TYK2
Synonyms:
Non-receptor tyrosine-protein kinase TYK2 (TYK2) TYK2_HUMAN | Tyrosine-protein kinase TYK2
Type:
Protein
Mol. Mass.:
133666.03
Organism:
Homo sapiens (Human)
Description:
P29597
Residue:
1187
  
Inhibitor
Name:
BDBM50548379
Synonyms:
CHEMBL4778704
Type:
Small organic molecule
Emp. Form.:
C20H18F3N9
Mol. Mass.:
441.4124
SMILES:
Cn1cc(cn1)-c1cn2nccc2c(n1)-c1cnn(c1)C1(CC#N)CN(CC(F)(F)F)C1
: