Target
Tyrosine-protein kinase JAK1
Ligand
BDBM50548371
Substrate
Meas. Tech.
ChEMBL_2021999 (CHEMBL4675812)
IC50
261±n/a nM
Citation
 Gerstenberger, BSAmbler, CArnold, EPBanker, MEBrown, MFClark, JDDermenci, ADowty, MEFensome, AFish, SHayward, MMHegen, MHollingshead, BDKnafels, JDLin, DWLin, THOwen, DRSaiah, ESharma, RVajdos, FFXing, LYang, XYang, XWright, SW Discovery of Tyrosine Kinase 2 (TYK2) Inhibitor (PF-06826647) for the Treatment of Autoimmune Diseases. J Med Chem 63:13561-13577 (2020)  
Target
Name:
Tyrosine-protein kinase JAK1
Synonyms:
JAK-1 JAK1A JAK1_HUMAN Janus kinase 1 (JAK1) | Janus kinase 1 JAK1
Type:
Protein
Mol. Mass.:
133293.73
Organism:
Homo sapiens (Human)
Description:
P23458
Residue:
1154
  
Inhibitor
Name:
BDBM50548371
Synonyms:
CHEMBL4777969
Type:
Small organic molecule
Emp. Form.:
C20H17N9
Mol. Mass.:
383.4093
SMILES:
Cn1ccc(n1)-c1cn2nccc2c(n1)-c1cnn(c1)[C@]1(CC#N)C[C@@H](C1)C#N
: