Target
Tyrosine-protein kinase JAK2
Ligand
BDBM305820
Substrate
Meas. Tech.
ChEMBL_2022007 (CHEMBL4675820)
IC50
22±n/a nM
Citation
 Gerstenberger, BSAmbler, CArnold, EPBanker, MEBrown, MFClark, JDDermenci, ADowty, MEFensome, AFish, SHayward, MMHegen, MHollingshead, BDKnafels, JDLin, DWLin, THOwen, DRSaiah, ESharma, RVajdos, FFXing, LYang, XYang, XWright, SW Discovery of Tyrosine Kinase 2 (TYK2) Inhibitor (PF-06826647) for the Treatment of Autoimmune Diseases. J Med Chem 63:13561-13577 (2020)  
Target
Name:
Tyrosine-protein kinase JAK2
Synonyms:
JAK-2 JAK2_HUMAN Janus kinase 2 (JAK2) | Janus kinase 2 (a protein tyrosine kinase)
Type:
Protein
Mol. Mass.:
130684.68
Organism:
Homo sapiens (Human)
Description:
O60674
Residue:
1132
  
Inhibitor
Name:
BDBM305820
Synonyms:
(1s,3s)-3-(Cyanomethyl)-3-(4-(6-(1-methyl-1H-pyrazol-4-yl)pyrazolo[1,5-a]pyrazin-4-yl)-1H-pyrazol-1-yl)cyclobutane-1-carbonitrile US10822341, Example 19 | US11472809, Example 19
Type:
Small organic molecule
Emp. Form.:
C20H17N9
Mol. Mass.:
383.4093
SMILES:
Cn1cc(cn1)-c1cn2nccc2c(n1)-c1cnn(c1)[C@]1(CC#N)C[C@@H](C1)C#N
: