Target
Non-receptor tyrosine-protein kinase TYK2/Tyrosine-protein kinase JAK2
Ligand
BDBM305821
Substrate
Meas. Tech.
ChEMBL_2022030 (CHEMBL4675843)
IC50
112±n/a nM
Citation
 Gerstenberger, BSAmbler, CArnold, EPBanker, MEBrown, MFClark, JDDermenci, ADowty, MEFensome, AFish, SHayward, MMHegen, MHollingshead, BDKnafels, JDLin, DWLin, THOwen, DRSaiah, ESharma, RVajdos, FFXing, LYang, XYang, XWright, SW Discovery of Tyrosine Kinase 2 (TYK2) Inhibitor (PF-06826647) for the Treatment of Autoimmune Diseases. J Med Chem 63:13561-13577 (2020)  
Target
Name:
Non-receptor tyrosine-protein kinase TYK2/Tyrosine-protein kinase JAK2
Synonyms:
JAK2/TYK2
Type:
Mol. Mass.:
Description:
ASSAY_ID of ChEMBL is 1368160
Components:
This complex has 2 components.
Component 1
Name:
Tyrosine-protein kinase JAK2
Synonyms:
JAK-2 JAK2_HUMAN Janus kinase 2 (JAK2) | Janus kinase 2 (a protein tyrosine kinase)
Type:
Protein
Mol. Mass.:
130684.68
Organism:
Homo sapiens (Human)
Description:
O60674
Residue:
1132
  
Component 2
Name:
Non-receptor tyrosine-protein kinase TYK2
Synonyms:
Non-receptor tyrosine-protein kinase TYK2 (TYK2) TYK2_HUMAN | Tyrosine-protein kinase TYK2
Type:
Protein
Mol. Mass.:
133666.03
Organism:
Homo sapiens (Human)
Description:
P29597
Residue:
1187
  
Inhibitor
Name:
BDBM305821
Synonyms:
(1r,3r)-3-(Cyanomethyl)-3-(4-(6-(1-methyl-1H-pyrazol-4-yl)pyrazolo[1,5-a]pyrazin-4-yl)-1H-pyrazol-1-yl)cyclobutane-1-carbonitrile US10822341, Example 20 | US11472809, Example 20
Type:
Small organic molecule
Emp. Form.:
C20H17N9
Mol. Mass.:
383.4093
SMILES:
Cn1cc(cn1)-c1cn2nccc2c(n1)-c1cnn(c1)[C@@]1(CC#N)C[C@@H](C1)C#N
: