Target
Dihydrofolate reductase
Ligand
BDBM50107972
Substrate
Meas. Tech.
ChEMBL_55100 (CHEMBL665360)
IC50
0.6±n/a nM
Citation
 Debnath, AK Pharmacophore mapping of a series of 2,4-diamino-5-deazapteridine inhibitors of Mycobacterium avium complex dihydrofolate reductase. J Med Chem 45:41-53 (2001)  
Target
Name:
Dihydrofolate reductase
Synonyms:
DHFR Dihydrofolate reductase (DHFR) | Tetrahydrofolate dehydrogenase
Type:
Enzyme
Mol. Mass.:
21453.99
Organism:
Homo sapiens (Human)
Description:
Recombinant human DHFR.
Residue:
187
  
Inhibitor
Name:
BDBM50107972
Synonyms:
6-[(3-Bromo-4-methyl-phenylamino)-methyl]-5-methyl-pyrido[2,3-d]pyrimidine-2,4-diamine | CHEMBL148814
Type:
Small organic molecule
Emp. Form.:
C16H17BrN6
Mol. Mass.:
373.25
SMILES:
Cc1ccc(NCc2cnc3nc(N)nc(N)c3c2C)cc1Br
: