Target
Dihydrofolate reductase
Ligand
BDBM50107981
Substrate
Meas. Tech.
ChEMBL_55100 (CHEMBL665360)
IC50
0.9±n/a nM
Citation
 Debnath, AK Pharmacophore mapping of a series of 2,4-diamino-5-deazapteridine inhibitors of Mycobacterium avium complex dihydrofolate reductase. J Med Chem 45:41-53 (2001)  
Target
Name:
Dihydrofolate reductase
Synonyms:
DHFR Dihydrofolate reductase (DHFR) | Tetrahydrofolate dehydrogenase
Type:
Enzyme
Mol. Mass.:
21453.99
Organism:
Homo sapiens (Human)
Description:
Recombinant human DHFR.
Residue:
187
  
Inhibitor
Name:
BDBM50107981
Synonyms:
6-[(2,5-Difluoro-phenylamino)-methyl]-5-methyl-pyrido[2,3-d]pyrimidine-2,4-diamine | CHEMBL151109
Type:
Small organic molecule
Emp. Form.:
C15H14F2N6
Mol. Mass.:
316.3087
SMILES:
Cc1c(CNc2cc(F)ccc2F)cnc2nc(N)nc(N)c12
: