Target
Dihydrofolate reductase
Ligand
BDBM50107990
Substrate
Meas. Tech.
ChEMBL_55100 (CHEMBL665360)
IC50
0.88±n/a nM
Citation
 Debnath, AK Pharmacophore mapping of a series of 2,4-diamino-5-deazapteridine inhibitors of Mycobacterium avium complex dihydrofolate reductase. J Med Chem 45:41-53 (2001)  
Target
Name:
Dihydrofolate reductase
Synonyms:
DHFR Dihydrofolate reductase (DHFR) | Tetrahydrofolate dehydrogenase
Type:
Enzyme
Mol. Mass.:
21453.99
Organism:
Homo sapiens (Human)
Description:
Recombinant human DHFR.
Residue:
187
  
Inhibitor
Name:
BDBM50107990
Synonyms:
CHEMBL359144 | xv5-Methyl-6-(pyren-1-ylaminomethyl)-pyrido[2,3-d]pyrimidineamine
Type:
Small organic molecule
Emp. Form.:
C25H20N6
Mol. Mass.:
404.4665
SMILES:
Cc1c(CNc2ccc3ccc4cccc5ccc2c3c45)cnc2nc(N)nc(N)c12
: