Target
Dimer of Protein farnesyltransferase subunit beta
Ligand
BDBM50067584
Substrate
Meas. Tech.
ChEMBL_70447 (CHEMBL680080)
IC50
0.61±n/a nM
Citation
 Ohkanda, JLockman, JWKothare, MAQian, YBlaskovich, MASebti, SMHamilton, AD Design and synthesis of potent nonpeptidic farnesyltransferase inhibitors based on a terphenyl scaffold. J Med Chem 45:177-88 (2001)  
Target
Name:
Dimer of Protein farnesyltransferase subunit beta
Synonyms:
Protein Farnesyltransferase (PFT) Chain B
Type:
Mol. Mass.:
Description:
ASSAY_ID of EBI is 51428
Components:
This complex has 3 components.
Component 1
Name:
Protein farnesyltransferase subunit beta
Synonyms:
CAAX farnesyltransferase subunit alpha FNTB FTase-alpha GGTase-I-alpha Protein farnesyl/geranylgeranyl transferase Protein farnesyltransferase subunit beta Protein farnesyltransferase/geranylgeranyltransferase type-1 subunit alpha Ras proteins prenyltransferase subunit beta | Type I protein geranyl-geranyltransferase subunit alpha
Type:
Enzyme Subunit
Mol. Mass.:
48766.02
Organism:
Homo sapiens (Human)
Description:
Protein farnesyltransferase subunit beta
Residue:
437
  
Component 2
Name:
Protein farnesyltransferase subunit beta
Synonyms:
CAAX farnesyltransferase subunit alpha FNTB FTase-alpha GGTase-I-alpha Protein farnesyl/geranylgeranyl transferase Protein farnesyltransferase subunit beta Protein farnesyltransferase/geranylgeranyltransferase type-1 subunit alpha Ras proteins prenyltransferase subunit beta | Type I protein geranyl-geranyltransferase subunit alpha
Type:
Enzyme Subunit
Mol. Mass.:
48766.02
Organism:
Homo sapiens (Human)
Description:
Protein farnesyltransferase subunit beta
Residue:
437
  
Inhibitor
Name:
BDBM50067584
Synonyms:
(S)-2-{[5-((R)-2-Amino-3-mercapto-propylamino)-biphenyl-2-carbonyl]-amino}-4-methylsulfanyl-butyric acid 2-{[5-(2-Amino-3-mercapto-propylamino)-biphenyl-2-carbonyl]-amino}-4-methylsulfanyl-butyric acid FTI-276
Type:
Small organic molecule
Emp. Form.:
C21H27N3O3S2
Mol. Mass.:
433.587
SMILES:
CSCC[C@H](NC(=O)c1ccc(NC[C@@H](N)CS)cc1-c1ccccc1)C(O)=O
: