Target
Transcription activator BRG1
Ligand
BDBM394406
Substrate
Meas. Tech.
ChEMBL_2023966 (CHEMBL4677779)
Kd
73±n/a nM
Citation
 Wanior, MPreuss, FNi, XKrämer, AMathea, SGöbel, THeidenreich, DSimonyi, SKahnt, ASJoerger, ACKnapp, S Pan-SMARCA/PB1 Bromodomain Inhibitors and Their Role in Regulating Adipogenesis. J Med Chem 63:14680-14699 (2020)  
Target
Name:
Transcription activator BRG1
Synonyms:
ATP-dependent helicase SMARCA4 BRG1 Mitotic growth and transcription activator Protein brahma homolog 1 SMCA4_HUMAN SNF2B SWI/SNF-related matrix-associated actin-dependent regulator of chromatin subfamily A member 4
Type:
PROTEIN
Mol. Mass.:
184666.66
Organism:
Homo sapiens (Human)
Description:
ChEMBL_107968
Residue:
1647
  
Inhibitor
Name:
BDBM394406
Synonyms:
2-(6-amino-5-(piperazin- | US10308614, Example 7
Type:
Small organic molecule
Emp. Form.:
C14H17N5O
Mol. Mass.:
271.3177
SMILES:
Nc1nnc(cc1N1CCNCC1)-c1ccccc1O
: