Target
Sorbitol dehydrogenase
Ligand
BDBM50108742
Substrate
Meas. Tech.
ChEMBL_201003 (CHEMBL801253)
IC50
23±n/a nM
Citation
 Chu-Moyer, MYBallinger, WEBeebe, DABerger, RCoutcher, JBDay, WWLi, JMylari, BLOates, PJWeekly, RM Orally-effective, long-acting sorbitol dehydrogenase inhibitors: synthesis, structure-activity relationships, and in vivo evaluations of novel heterocycle-substituted piperazino-pyrimidines. J Med Chem 45:511-28 (2002)  
Target
Name:
Sorbitol dehydrogenase
Synonyms:
DHSO_HUMAN SORD
Type:
PROTEIN
Mol. Mass.:
38332.20
Organism:
Homo sapiens (Human)
Description:
ChEMBL_223910
Residue:
357
  
Inhibitor
Name:
BDBM50108742
Synonyms:
1-[4-(3-Methyl-4-oxazolo[5,4-c]pyridin-2-yl-piperazin-1-yl)-pyrimidin-2-yl]-ethanol | CHEMBL149048
Type:
Small organic molecule
Emp. Form.:
C17H20N6O2
Mol. Mass.:
340.3797
SMILES:
C[C@@H](O)c1nccc(n1)N1CCN([C@@H](C)C1)c1nc2ccncc2o1
: