Target
Cathepsin B
Ligand
BDBM50108849
Substrate
Meas. Tech.
ChEMBL_47434 (CHEMBL661175)
Ki
1700±n/a nM
Citation
 Huang, LLee, AEllman, JA Identification of potent and selective mechanism-based inhibitors of the cysteine protease cruzain using solid-phase parallel synthesis. J Med Chem 45:676-84 (2002)  
Target
Name:
Cathepsin B
Synonyms:
APP secretase CATB_HUMAN CTSB Cathepsin B light chain | Cathepsin B1
Type:
Enzyme
Mol. Mass.:
37819.69
Organism:
Homo sapiens (Human)
Description:
gi_63102437
Residue:
339
  
Inhibitor
Name:
BDBM50108849
Synonyms:
CHEMBL321974 {3-Methyl-1-[2-oxo-1-phenethyl-3-(3-phenyl-propylsulfanyl)-propylcarbamoyl]-butyl}-carbamic acid pyridin-3-ylmethyl ester
Type:
Small organic molecule
Emp. Form.:
C33H41N3O4S
Mol. Mass.:
575.761
SMILES:
CC(C)C[C@H](NC(=O)OCc1cccnc1)C(=O)N[C@@H](CCc1ccccc1)C(=O)CSCCCc1ccccc1
: