Target
Cruzipain
Ligand
BDBM50108849
Substrate
Meas. Tech.
ChEMBL_51847 (CHEMBL664070)
Ki
1.1±n/a nM
Citation
 Huang, LLee, AEllman, JA Identification of potent and selective mechanism-based inhibitors of the cysteine protease cruzain using solid-phase parallel synthesis. J Med Chem 45:676-84 (2002)  
Target
Name:
Cruzipain
Synonyms:
CYSP_TRYCR Cruzaine | Major cysteine proteinase
Type:
Protein
Mol. Mass.:
49831.41
Organism:
Trypanosoma cruzi
Description:
P25779
Residue:
467
  
Inhibitor
Name:
BDBM50108849
Synonyms:
CHEMBL321974 {3-Methyl-1-[2-oxo-1-phenethyl-3-(3-phenyl-propylsulfanyl)-propylcarbamoyl]-butyl}-carbamic acid pyridin-3-ylmethyl ester
Type:
Small organic molecule
Emp. Form.:
C33H41N3O4S
Mol. Mass.:
575.761
SMILES:
CC(C)C[C@H](NC(=O)OCc1cccnc1)C(=O)N[C@@H](CCc1ccccc1)C(=O)CSCCCc1ccccc1
: