Target
Cereblon isoform 4
Ligand
BDBM50549802
Substrate
Meas. Tech.
ChEMBL_2025840 (CHEMBL4679653)
Ki
22000±n/a nM
Citation
 Maiwald, SHeim, CHernandez Alvarez, BHartmann, MD Sweet and Blind Spots in E3 Ligase Ligand Space Revealed by a Thermophoresis-Based Assay. ACS Med Chem Lett 12:74-81 (2021)  
Target
Name:
Cereblon isoform 4
Synonyms:
Cereblon isoform 4
Type:
PROTEIN
Mol. Mass.:
13620.40
Organism:
Magnetospirillum gryphiswaldense
Description:
ChEMBL_116733
Residue:
124
  
Inhibitor
Name:
BDBM50549802
Synonyms:
CHEMBL1258836
Type:
Small organic molecule
Emp. Form.:
C22H29FN3O9P
Mol. Mass.:
529.4525
SMILES:
CC(C)OC(=O)[C@@H](C)NP(=O)(OC[C@H]1O[C@@H](n2ccc(=O)[nH]c2=O)[C@](C)(F)[C@@H]1O)Oc1ccccc1
: