Target
Cereblon isoform 4
Ligand
BDBM7814
Substrate
Meas. Tech.
ChEMBL_2025844 (CHEMBL4679657)
Ki
642±n/a nM
Citation
 Maiwald, SHeim, CHernandez Alvarez, BHartmann, MD Sweet and Blind Spots in E3 Ligase Ligand Space Revealed by a Thermophoresis-Based Assay. ACS Med Chem Lett 12:74-81 (2021)  
Target
Name:
Cereblon isoform 4
Synonyms:
Cereblon isoform 4
Type:
PROTEIN
Mol. Mass.:
13620.40
Organism:
Magnetospirillum gryphiswaldense
Description:
ChEMBL_116733
Residue:
124
  
Inhibitor
Name:
BDBM7814
Synonyms:
Maleimide-Related Compound 13 | pyrrolidine-2,5-dione
Type:
Small organic molecule
Emp. Form.:
C4H5NO2
Mol. Mass.:
99.088
SMILES:
O=C1CCC(=O)N1
: