Target
DNA-dependent protein kinase catalytic subunit
Ligand
BDBM50549828
Substrate
Meas. Tech.
ChEMBL_2025893 (CHEMBL4679706)
Ki
3400±n/a nM
Citation
 Bandarage, UKAronov, AMCao, JCome, JHCottrell, KMDavies, RJGiroux, SJacobs, MMahajan, SMessersmith, DMoody, CSSwett, RXu, J Discovery of a Novel Series of Potent and Selective Alkynylthiazole-Derived PI3K? Inhibitors. ACS Med Chem Lett 12:129-135 (2021)  
Target
Name:
DNA-dependent protein kinase catalytic subunit
Synonyms:
DNA-PK catalytic subunit DNA-dependent protein kinase (DNA-PK) DNA-dependent protein kinase catalytic subunit (DNA-PK) HYRC PRKDC | PRKDC_HUMAN
Type:
Protein
Mol. Mass.:
469114.78
Organism:
Homo sapiens (Human)
Description:
P78527
Residue:
4128
  
Inhibitor
Name:
BDBM50549828
Synonyms:
CHEMBL4795990
Type:
Small organic molecule
Emp. Form.:
C19H18F2N6OS
Mol. Mass.:
416.448
SMILES:
Cc1nc(NC(=O)NCCc2cn(CC(F)F)cn2)sc1C#Cc1cccnc1
: