Target
Histone deacetylase 3
Ligand
BDBM476629
Substrate
Meas. Tech.
ChEMBL_2027198 (CHEMBL4681356)
IC50
33±n/a nM
Citation
 McClure, JJZhang, CInks, ESPeterson, YKLi, JChou, CJ Development of Allosteric Hydrazide-Containing Class I Histone Deacetylase Inhibitors for Use in Acute Myeloid Leukemia. J Med Chem 59:9942-9959 (2016)  
Target
Name:
Histone deacetylase 3
Synonyms:
HD3 HDAC3_HUMAN Human HDAC3 SMAP45
Type:
Enzyme
Mol. Mass.:
48829.55
Organism:
Homo sapiens (Human)
Description:
O15379
Residue:
428
  
Inhibitor
Name:
BDBM476629
Synonyms:
N-(4-(2-pentylhydrazine-1- carbonyl)benzyl)cinnamamide | US10870618, Compound 3d
Type:
Small organic molecule
Emp. Form.:
C22H27N3O2
Mol. Mass.:
365.4687
SMILES:
CCCCCNNC(=O)c1ccc(CNC(=O)\C=C\c2ccccc2)cc1
: