Target
Estrogen-related receptor gamma
Ligand
BDBM485047
Substrate
Meas. Tech.
ChEMBL_2027414 (CHEMBL4681572)
IC50
20±n/a nM
Citation
 Kim, JWoo, SYIm, CYYoo, EKLee, SKim, HJHwang, HJCho, JHLee, WSYoon, HKim, SKwon, OBHwang, HKim, KHJeon, JHSingh, TDKim, SWHwang, SYChoi, HSLee, IKKim, SHJeon, YHChin, JCho, SJ Insights of a Lead Optimization Study and Biological Evaluation of Novel 4-Hydroxytamoxifen Analogs as Estrogen-Related Receptor ? (ERR?) Inverse Agonists. J Med Chem 59:10209-10227 (2016)  
Target
Name:
Estrogen-related receptor gamma
Synonyms:
ERR gamma-2 ERR3_HUMAN ESRRG Estrogen-Related Receptor, gamma KIAA0832 Nuclear receptor subfamily 3 group B member 3
Type:
PROTEIN
Mol. Mass.:
51305.00
Organism:
Homo sapiens (Human)
Description:
ChEMBL_1501351
Residue:
458
  
Inhibitor
Name:
BDBM485047
Synonyms:
US10934303, Cmpd No. 6g US10934303, Example 11 US11285226, Compound 6g
Type:
Small organic molecule
Emp. Form.:
C30H35NO3
Mol. Mass.:
457.6038
SMILES:
CN1CCCC1CCOc1ccc(cc1)C(=C(\CCCO)c1ccccc1)\c1ccc(O)cc1
: