Target
Tissue alpha-L-fucosidase
Ligand
BDBM50174834
Substrate
Meas. Tech.
ChEMBL_2029541 (CHEMBL4683699)
IC50
91000±n/a nM
Citation
 Luthra, TBanothu, VAdepally, UKumar, KM, SChakrabarti, SMaddi, SRSen, S Discovery of novel pyrido-pyrrolidine hybrid compounds as alpha-glucosidase inhibitors and alternative agent for control of type 1 diabetes. Eur J Med Chem 188:0 (2020)  
Target
Name:
Tissue alpha-L-fucosidase
Synonyms:
Alpha-L-fucosidase 1 FUCO_BOVIN
Type:
PROTEIN
Mol. Mass.:
54093.12
Organism:
Bos taurus
Description:
ChEMBL_335897
Residue:
468
  
Inhibitor
Name:
BDBM50174834
Synonyms:
CHEMBL382280 Sulfonamide chalcone, 6
Type:
Small organic molecule
Emp. Form.:
C22H19NO4S
Mol. Mass.:
393.456
SMILES:
Cc1ccc(cc1)S(=O)(=O)Nc1cccc(c1)C(=O)\C=C\c1ccc(O)cc1
: