Target
Fatty-acid amide hydrolase 1 [30-579]
Ligand
BDBM50431274
Substrate
Meas. Tech.
ChEMBL_2029685 (CHEMBL4683843)
IC50
492±n/a nM
Citation
 Tripathi, RKP A perspective review on fatty acid amide hydrolase (FAAH) inhibitors as potential therapeutic agents. Eur J Med Chem 188:0 (2020)  
Target
Name:
Fatty-acid amide hydrolase 1 [30-579]
Synonyms:
Anandamide amidohydrolase 1 Faah Fatty Acid Amide Hydrolase Fatty-acid amide hydrolase (FAAH) Fatty-acid amide hydrolase 1 (FAAH) Oleamide hydrolase 1
Type:
Single-pass membrane protein; homodimer
Mol. Mass.:
60474.00
Organism:
Rattus norvegicus (rat)
Description:
P97612 (aa 30-579)
Residue:
550
  
Inhibitor
Name:
BDBM50431274
Synonyms:
CHEMBL2333065
Type:
Small organic molecule
Emp. Form.:
C11H17N3O3
Mol. Mass.:
239.271
SMILES:
CCCCCCNC(=O)n1ccc(=O)[nH]c1=O
: