Target
Cyclin-dependent kinase 3/G1/S-specific cyclin-E1
Ligand
BDBM50552007
Substrate
Meas. Tech.
ChEMBL_2032765 (CHEMBL4686923)
IC50
117±n/a nM
Citation
 Zhang, SHuang, CLyu, XWang, PZang, YWang, ZWang, HLi, JZhao, Y Discovery of a 2-pyridinyl urea-containing compound YD57 as a potent inhibitor of apoptosis signal-regulating kinase 1 (ASK1). Eur J Med Chem 195:0 (2020)  
Target
Name:
Cyclin-dependent kinase 3/G1/S-specific cyclin-E1
Synonyms:
CDK3/Cyclin E | CDK3/E
Type:
Protein
Mol. Mass.:
Description:
Components:
This complex has 2 components.
Component 1
Name:
Cyclin-dependent kinase 3
Synonyms:
CDK3 CDK3_HUMAN Cyclin-dependent kinase 3 | Cyclin-dependent kinase 3 (CDK3)
Type:
Enzyme
Mol. Mass.:
35053.88
Organism:
Homo sapiens (Human)
Description:
Q00526
Residue:
305
  
Component 2
Name:
G1/S-specific cyclin-E1
Synonyms:
CCNE CCNE1_HUMAN
Type:
Enzyme Subunit
Mol. Mass.:
47073.17
Organism:
Homo sapiens (Human)
Description:
Residue:
410
  
Inhibitor
Name:
BDBM50552007
Synonyms:
CHEMBL4796925
Type:
Small organic molecule
Emp. Form.:
C18H18N8O2
Mol. Mass.:
378.3879
SMILES:
C[C@H](CO)n1cnnc1-c1cccc(NC(=O)Nc2cc3ccccn3n2)n1
: