Target
Glutamate receptor ionotropic, NMDA 1/2A
Ligand
BDBM50044140
Substrate
Meas. Tech.
ChEMBL_2033648 (CHEMBL4687806)
Ki
180±n/a nM
Citation
 Das, J Repurposing of Drugs-The Ketamine Story. J Med Chem 63:13514-13525 (2020)  
Target
Name:
Glutamate receptor ionotropic, NMDA 1/2A
Synonyms:
Glutamate NMDA receptor; Grin1/Grin2a | Glutamate [NMDA] receptor subunit epsilon 1/zeta 1
Type:
Mol. Mass.:
Description:
ASSAY_ID of EBI is 141020
Components:
This complex has 2 components.
Component 1
Name:
Glutamate receptor ionotropic, NMDA 2A
Synonyms:
Glutamate NMDA receptor; Grin1/Grin2a Grin2a NMDE1_RAT
Type:
Protein
Mol. Mass.:
165478.25
Organism:
Rattus norvegicus (Rat)
Description:
Q00959
Residue:
1464
  
Component 2
Name:
Glutamate receptor ionotropic, NMDA 1
Synonyms:
Glutamate (NMDA) receptor subunit zeta 1 Glutamate-NMDA-Channel Glutamate-NMDA-Polyamine NMDA Nmdar1 | phencyclidine
Type:
Enzyme Catalytic Domain
Mol. Mass.:
105533.40
Organism:
RAT
Description:
P35439
Residue:
938
  
Inhibitor
Name:
BDBM50044140
Synonyms:
2-(2-Chloro-phenyl)-2-methylamino-cyclohexanone CHEMBL742 Ketalar
Type:
Small organic molecule
Emp. Form.:
C13H16ClNO
Mol. Mass.:
237.725
SMILES:
CNC1(CCCCC1=O)c1ccccc1Cl
: