Target
Heat shock protein HSP 90-alpha
Ligand
BDBM50389796
Substrate
Meas. Tech.
ChEMBL_2035399 (CHEMBL4689557)
Kd
29000±n/a nM
Citation
 Tosh, DKBrackett, CMJung, YHGao, ZGBanerjee, MBlagg, BSJJacobson, KA Biological Evaluation of 5'-( ACS Med Chem Lett 12:373-379 (2021)  
Target
Name:
Heat shock protein HSP 90-alpha
Synonyms:
HS90A_HUMAN HSP86 HSP90AA1 HSPCA Heat shock 86 kDa Heat shock protein HSP 90-alpha (HSP90) LAP-2 Lipopolysaccharide-associated protein 2 heat shock protein 90kDa alpha (cytosolic), class A member 1 isoform 2
Type:
Molecular Chaperone
Mol. Mass.:
84623.45
Organism:
Homo sapiens (Human)
Description:
P07900
Residue:
732
  
Inhibitor
Name:
BDBM50389796
Synonyms:
CHEMBL1235128
Type:
Small organic molecule
Emp. Form.:
C13H18N6O4
Mol. Mass.:
322.3198
SMILES:
CCCNC(=O)[C@H]1O[C@H]([C@H](O)[C@@H]1O)n1cnc2c(N)ncnc12
: