Target
Sorbitol dehydrogenase
Ligand
BDBM50113493
Substrate
Meas. Tech.
ChEMBL_201005 (CHEMBL801255)
IC50
19±n/a nM
Citation
 Chu-Moyer, MYBallinger, WEBeebe, DACoutcher, JBDay, WWLi, JOates, PJWeekly, RM SAR and species/stereo-selective metabolism of the sorbitol dehydrogenase inhibitor, CP-470,711. Bioorg Med Chem Lett 12:1477-80 (2002)  
Target
Name:
Sorbitol dehydrogenase
Synonyms:
DHSO_HUMAN SORD
Type:
PROTEIN
Mol. Mass.:
38332.20
Organism:
Homo sapiens (Human)
Description:
ChEMBL_223910
Residue:
357
  
Inhibitor
Name:
BDBM50113493
Synonyms:
1-(4-{(3S,5R)-4-[2-((R)-1-Hydroxy-ethyl)-pyrimidin-4-yl]-3,5-dimethyl-piperazin-1-yl}-pyrimidin-2-yl)-ethanone | CHEMBL286539
Type:
Small organic molecule
Emp. Form.:
C18H24N6O2
Mol. Mass.:
356.4222
SMILES:
C[C@@H](O)c1nccc(n1)N1[C@@H](C)CN(C[C@H]1C)c1ccnc(n1)C(C)=O
: