Target
Prolactin-releasing peptide receptor
Ligand
BDBM50553366
Substrate
Meas. Tech.
ChEMBL_2046262 (CHEMBL4700961)
EC50
20±n/a nM
Citation
 Pflimlin, ELear, SLee, CYu, SZou, HTo, AJoseph, SNguyen-Tran, VTremblay, MSShen, W Design of a Long-Acting and Selective MEG-Fatty Acid Stapled Prolactin-Releasing Peptide Analog. ACS Med Chem Lett 10:1166-1172 (2019)  
Target
Name:
Prolactin-releasing peptide receptor
Synonyms:
G-protein coupled receptor 10 (GPR10) GR3 PRLHR_HUMAN Prolactin-releasing peptide receptor
Type:
Protein
Mol. Mass.:
41138.32
Organism:
Homo sapiens (Human)
Description:
P49683
Residue:
370
  
Inhibitor
Name:
BDBM50553366
Synonyms:
CHEMBL4785985
Type:
Small organic molecule
Emp. Form.:
C159H250N54O45S3
Mol. Mass.:
3734.216
SMILES:
CC[C@H](C)[C@H](NC(=O)CNC(=O)[C@H](CCCNC(N)=N)NC(=O)CNC(=O)[C@@H](NC(=O)[C@H](Cc1ccc(O)cc1)NC(=O)[C@H](Cc1c[nH]c2ccccc12)NC(=O)[C@H](C)NC(=O)[C@@H]1CCCN1C(=O)[C@H](CC(N)=O)NC(=O)[C@@H](NC(=O)[C@H](CC(O)=O)NC(=O)[C@@H]1CSCC(=O)NCCCCNC(=O)CSC[C@H](NC(=O)[C@H](CCC(N)=O)NC(=O)[C@H](Cc2cnc[nH]2)NC(=O)[C@H](C)NC(=O)[C@H](CCCNC(N)=N)NC(=O)[C@@H](N)CO)C(=O)N[C@@H](CO)C(=O)N[C@@H](CCSC)C(=O)N[C@@H](CCC(O)=O)C(=O)N[C@@H]([C@@H](C)O)C(=O)N[C@@H](CCCNC(N)=N)C(=O)N[C@@H]([C@@H](C)O)C(=O)N1)[C@@H](C)CC)[C@@H](C)O)C(=O)N[C@@H](CCCNC(N)=N)C(=O)N1CCC[C@H]1C(=O)N[C@@H](C(C)C)C(=O)NCC(=O)N[C@@H](CCCNC(N)=N)C(=O)N[C@@H](Cc1ccccc1)C(N)=O
: