Target
Prolactin-releasing peptide receptor
Ligand
BDBM50553376
Substrate
Meas. Tech.
ChEMBL_2046262 (CHEMBL4700961)
EC50
6.1±n/a nM
Citation
 Pflimlin, ELear, SLee, CYu, SZou, HTo, AJoseph, SNguyen-Tran, VTremblay, MSShen, W Design of a Long-Acting and Selective MEG-Fatty Acid Stapled Prolactin-Releasing Peptide Analog. ACS Med Chem Lett 10:1166-1172 (2019)  
Target
Name:
Prolactin-releasing peptide receptor
Synonyms:
G-protein coupled receptor 10 (GPR10) GR3 PRLHR_HUMAN Prolactin-releasing peptide receptor
Type:
Protein
Mol. Mass.:
41138.32
Organism:
Homo sapiens (Human)
Description:
P49683
Residue:
370
  
Inhibitor
Name:
BDBM50553376
Synonyms:
CHEMBL4752167
Type:
Small organic molecule
Emp. Form.:
C190H303N59O52S3
Mol. Mass.:
4341.998
SMILES:
CCCCCCCCCCCCCC(=O)NCCOCCOCCNC(=O)CCOCCOCCNC(=O)[C@H]1CCCNC(=O)CSC[C@H](NC(=O)[C@H](CC(O)=O)NC(=O)[C@@H]2CCCN2C(=O)[C@@H](NC(=O)[C@H](CCCNC(N)=N)NC(=O)[C@@H](NC(=O)[C@H](CCC(O)=O)NC(=O)[C@H](CCSC)NC(=O)[C@H](CO)NC(=O)[C@H](Cc2cnc[nH]2)NC(=O)[C@H](CCC(N)=O)NC(=O)[C@H](Cc2cnc[nH]2)NC(=O)[C@H](C)NC(=O)[C@H](CCCNC(N)=N)NC(=O)[C@@H](N)CO)[C@@H](C)O)[C@@H](C)O)C(=O)N[C@@H](CC(N)=O)C(=O)N2CCC[C@H]2C(=O)N[C@@H](C)C(=O)N[C@@H](Cc2c[nH]c3ccccc23)C(=O)N[C@@H](Cc2ccc(O)cc2)C(=O)N[C@@H]([C@@H](C)O)C(=O)N[C@@H](CSCC(=O)N1)C(=O)N[C@@H](CCCNC(N)=N)C(=O)NCC(=O)N[C@@H]([C@@H](C)CC)C(=O)N[C@@H](CCCNC(N)=N)C(=O)N1CCC[C@H]1C(=O)N[C@@H](C(C)C)C(=O)NCC(=O)N[C@@H](CCCNC(N)=N)C(=O)N[C@@H](Cc1ccccc1)C(N)=O
: