Target
Macrophage migration inhibitory factor
Ligand
BDBM50553871
Substrate
Meas. Tech.
ChEMBL_2047508 (CHEMBL4702207)
Kd
390±n/a nM
Citation
 Xiao, ZChen, DSong, Svan der Vlag, Rvan der Wouden, PEvan Merkerk, RCool, RHHirsch, AKHMelgert, BNQuax, WJPoelarends, GJDekker, FJ 7-Hydroxycoumarins Are Affinity-Based Fluorescent Probes for Competitive Binding Studies of Macrophage Migration Inhibitory Factor. J Med Chem 63:11920-11933 (2020)  
Target
Name:
Macrophage migration inhibitory factor
Synonyms:
GIF Glycosylation-inhibiting factor L-dopachrome tautomerase MIF/CD74 (Macrophage migration inhibitory factor and HLA-DR antigens-associated invariant chain) MMIF Macrophage migration inhibitory factor (MIF) | Phenylpyruvate tautomerase
Type:
Enzyme
Mol. Mass.:
12478.18
Organism:
Homo sapiens (Human)
Description:
P14174
Residue:
115
  
Inhibitor
Name:
BDBM50553871
Synonyms:
CHEMBL1392132
Type:
Small organic molecule
Emp. Form.:
C16H12O4
Mol. Mass.:
268.2641
SMILES:
COc1ccc(cc1)-c1cc2ccc(O)cc2oc1=O
: