Target
DNA gyrase subunit A/B
Ligand
BDBM50554217
Substrate
Meas. Tech.
ChEMBL_2048803 (CHEMBL4703502)
IC50
0.940000±n/a nM
Citation
 Ushiyama, FAmada, HMihara, YTakeuchi, TTanaka-Yamamoto, NMima, MKamitani, MWada, RTamura, YEndo, MMasuko, ATakata, IHitaka, KSugiyama, HOhtake, N Lead optimization of 8-(methylamino)-2-oxo-1,2-dihydroquinolines as bacterial type II topoisomerase inhibitors. Bioorg Med Chem 28:0 (2020)  
Target
Name:
DNA gyrase subunit A/B
Synonyms:
DNA Gyrase | DNA gyrase A/B
Type:
A2B2 tetramer
Mol. Mass.:
Description:
Components:
This complex has 2 components.
Component 1
Name:
DNA gyrase subunit A
Synonyms:
DNA gyrase GYRA_ECOLI hisW parD
Type:
Enzyme Subunit
Mol. Mass.:
96935.15
Organism:
Escherichia coli (strain K12)
Description:
Residue:
875
  
Component 2
Name:
DNA gyrase subunit B
Synonyms:
DNA gyrase subunit B GYRB_ECOLI acrB gyrB hisU parA | pcbA
Type:
Enzyme Subunit
Mol. Mass.:
89941.28
Organism:
Escherichia coli (strain K12)
Description:
P0AES6
Residue:
804
  
Inhibitor
Name:
BDBM50554217
Synonyms:
CHEMBL4776836
Type:
Small organic molecule
Emp. Form.:
C21H22FN5O6
Mol. Mass.:
459.4277
SMILES:
OC=O.CNc1cc(F)cc2c(NCCN)c(C(=O)Nc3ccc(cc3)C(O)=O)c(=O)[nH]c12
: