Target
Acidic mammalian chitinase
Ligand
BDBM50554344
Substrate
Meas. Tech.
ChEMBL_2049319 (CHEMBL4704018)
IC50
1.000000±n/a nM
Target
Name:
Acidic mammalian chitinase
Synonyms:
AMCase Chia YNL
Type:
PROTEIN
Mol. Mass.:
51991.60
Organism:
Mus musculus
Description:
ChEMBL_828636
Residue:
473
  
Inhibitor
Name:
BDBM50554344
Synonyms:
CHEMBL4756869
Type:
Small organic molecule
Emp. Form.:
C22H33ClN6O
Mol. Mass.:
432.99
SMILES:
CC(C)C[C@H]1CN([C@@H](Cc2ccc(Cl)cc2)CO1)C1CCN(CC1)c1nc(N)n[nH]1
: