Target
Dual specificity mitogen-activated protein kinase kinase 6
Ligand
BDBM50115297
Substrate
Meas. Tech.
ChEMBL_123998 (CHEMBL734026)
IC50
>30000±n/a nM
Citation
 Matsuno, KIchimura, MNakajima, TTahara, KFujiwara, SKase, HUshiki, JGiese, NAPandey, AScarborough, RMLokker, NAYu, JCIrie, JTsukuda, EIde, SOda, SNomoto, Y Potent and selective inhibitors of platelet-derived growth factor receptor phosphorylation. 1. Synthesis, structure-activity relationship, and biological effects of a new class of quinazoline derivatives. J Med Chem 45:3057-66 (2002)  
Target
Name:
Dual specificity mitogen-activated protein kinase kinase 6
Synonyms:
Dual specificity mitogen-activated protein kinase kinase 6 MAP2K6 MAPKK 6 MKK6 Mitogen-activated protein kinase kinase 6 (MKK6) SAPKK3 | SKK3
Type:
Protein
Mol. Mass.:
37494.96
Organism:
Homo sapiens (Human)
Description:
P52564
Residue:
334
  
Inhibitor
Name:
BDBM50115297
Synonyms:
4-(6,7-Dimethoxy-quinazolin-4-yl)-piperazine-1-carboxylic acid (4-cyano-phenyl)-amide | CHEMBL106966
Type:
Small organic molecule
Emp. Form.:
C22H22N6O3
Mol. Mass.:
418.4485
SMILES:
COc1cc2ncnc(N3CCN(CC3)C(=O)Nc3ccc(cc3)C#N)c2cc1OC
: