Target
Death-associated protein kinase 3
Ligand
BDBM50554817
Substrate
Meas. Tech.
ChEMBL_2050825 (CHEMBL4705524)
IC50
260±n/a nM
Citation
 Chen, JZhou, YDong, XLiu, LBai, LMcEachern, DPrzybranowski, SYang, CYStuckey, JLi, XWen, BZhao, TSun, SSun, DJiao, LJing, YGuo, MYang, DWang, S Discovery of CJ-2360 as a Potent and Orally Active Inhibitor of Anaplastic Lymphoma Kinase Capable of Achieving Complete Tumor Regression. J Med Chem 63:13994-14016 (2020)  
Target
Name:
Death-associated protein kinase 3
Synonyms:
DAP kinase 3 DAPK3 ZIP-kinase | ZIPK
Type:
PROTEIN
Mol. Mass.:
52537.07
Organism:
Homo sapiens (Human)
Description:
ChEMBL_586564
Residue:
454
  
Inhibitor
Name:
BDBM50554817
Synonyms:
CHEMBL4764610
Type:
Small organic molecule
Emp. Form.:
C27H30FN5O2
Mol. Mass.:
475.5578
SMILES:
COc1cc2c(c(F)c1N1C[C@H](C)N(C)[C@H](C)C1)n(C(C)C)c1[nH]c3cc(ccc3c1c2=O)C#N
: