Target
Thyroid hormone receptor alpha
Ligand
BDBM50115666
Substrate
Meas. Tech.
ChEMBL_210491 (CHEMBL814598)
Kd
5.2±n/a nM
Citation
 Nguyen, NHApriletti, JWCunha Lima, STWebb, PBaxter, JDScanlan, TS Rational design and synthesis of a novel thyroid hormone antagonist that blocks coactivator recruitment. J Med Chem 45:3310-20 (2002)  
Target
Name:
Thyroid hormone receptor alpha
Synonyms:
C-erbA-alpha EAR7 NR1A1 THA_HUMAN THRA1 Thyroid Hormone Receptor (TR-alpha) Thyroid hormone receptor alpha c-erbA-1
Type:
Receptor
Mol. Mass.:
54818.00
Organism:
Homo sapiens (Human)
Description:
Recombinant hThR was obtained from nuclear extracts from SF9 cells infected with baculovirus vectors encoding for ThRalpha 1.
Residue:
490
  
Inhibitor
Name:
BDBM50115666
Synonyms:
CHEMBL109430 | {4-[4-Hydroxy-3-isopropyl-5-(4-pentyl-phenylethynyl)-benzyl]-3,5-dimethyl-phenoxy}-acetic acid(NH-2)
Type:
Small organic molecule
Emp. Form.:
C33H38O4
Mol. Mass.:
498.6524
SMILES:
CCCCCc1ccc(cc1)C#Cc1cc(Cc2c(C)cc(OCC(O)=O)cc2C)cc(C(C)C)c1O
: